Update counters to allow page and footnote resets

1 job for footnotes in 6 minutes and 27 seconds (queued for 8 seconds)
Status Job ID Name Coverage
failed #972


Name Stage Failure
npm-test Build
npm ERR! Exit status 1
npm ERR!
npm ERR! Failed at the pagedjs@0.1.43 specs script.
npm ERR! This is probably not a problem with npm. There is likely additional logging output above.

npm ERR! A complete log of this run can be found in:
npm ERR! /home/node/.npm/_logs/2021-04-09T05_57_31_665Z-debug.log
npm ERR! Test failed. See above for more details.
ERROR: Job failed: exit status 1