Implement footnote counter resets on elements and atpage

1 job for footnotes in 4 minutes and 51 seconds (queued for 3 seconds)
Status Job ID Name Coverage
failed #901


Name Stage Failure
npm-test Build
npm ERR! Exit status 1
npm ERR!
npm ERR! Failed at the pagedjs@0.1.40 specs script.
npm ERR! This is probably not a problem with npm. There is likely additional logging output above.

npm ERR! A complete log of this run can be found in:
npm ERR! /home/node/.npm/_logs/2021-02-02T05_16_00_592Z-debug.log
npm ERR! Test failed. See above for more details.
ERROR: Job failed: exit status 1