Fixes for footnote marker and call content and styles

1 job for footnotes in 1 minute and 37 seconds (queued for 3 seconds)
Status Job ID Name Coverage
  Build
failed #867
npm-test

00:01:37

 
Name Stage Failure
failed
npm-test Build
npm ERR! Exit status 1
npm ERR!
npm ERR! Failed at the pagedjs@0.1.40 lint script.
npm ERR! This is probably not a problem with npm. There is likely additional logging output above.

npm ERR! A complete log of this run can be found in:
npm ERR! /home/node/.npm/_logs/2020-12-09T06_37_05_558Z-debug.log
npm ERR! Test failed. See above for more details.
ERROR: Job failed: exit status 1