add specs file

1 job for page-border in 28 seconds (queued for 1 second)
Status Job ID Name Coverage
  Build
failed #691
npm-test

00:00:28

 
Name Stage Failure
failed
npm-test Build
npm ERR! Exit status 1
npm ERR!
npm ERR! Failed at the pagedjs@0.1.41 lint script.
npm ERR! This is probably not a problem with npm. There is likely additional logging output above.

npm ERR! A complete log of this run can be found in:
npm ERR! /home/node/.npm/_logs/2020-06-16T12_09_07_305Z-debug.log
npm ERR! Test failed. See above for more details.
ERROR: Job failed: exit status 1