feat(polyfill): add a 'handlers' property to PagedConfig global object

Also, export the polyfill initializer to mesure side effects
1 job for feature/polyfill-handlers in 3 minutes and 54 seconds (queued for 3 seconds)
latest
Status Job ID Name Coverage
  Test
failed #338
build_image

00:03:54

 
Name Stage Failure
failed
build_image Test
npm ERR! Exit status 1
npm ERR!
npm ERR! Failed at the pagedjs@0.1.34 specs script.
npm ERR! This is probably not a problem with npm. There is likely additional logging output above.

npm ERR! A complete log of this run can be found in:
npm ERR! /home/node/.npm/_logs/2019-08-22T14_46_13_692Z-debug.log
npm ERR! Test failed. See above for more details.
ERROR: Job failed: exit status 1