0.1.43-next.1617691164

2 jobs for v0.1.43-next.1617691164 in 4 minutes and 32 seconds (queued for 2 seconds)
latest
Status Job ID Name Coverage
  Build
failed #1114
npm-test

00:04:32

 
  Publish
skipped #1115
npm-publish
 
Name Stage Failure
failed
npm-test Build
npm ERR! Exit status 1
npm ERR!
npm ERR! Failed at the @ggrossetie/pagedjs@0.1.43-next.1617691164 specs script.
npm ERR! This is probably not a problem with npm. There is likely additional logging output above.

npm ERR! A complete log of this run can be found in:
npm ERR! /home/node/.npm/_logs/2021-06-13T10_27_23_460Z-debug.log
npm ERR! Test failed. See above for more details.
ERROR: Job failed: exit status 1