0.1.43-next.1617691164

1 job for next in 5 minutes and 58 seconds (queued for 2 seconds)
Status Job ID Name Coverage
  Build
failed #961
npm-test

00:05:58

 
Name Stage Failure
failed
npm-test Build
npm ERR! Exit status 1
npm ERR!
npm ERR! Failed at the @ggrossetie/pagedjs@0.1.43-next.1617691164 specs script.
npm ERR! This is probably not a problem with npm. There is likely additional logging output above.

npm ERR! A complete log of this run can be found in:
npm ERR! /home/node/.npm/_logs/2021-04-06T07_10_15_458Z-debug.log
npm ERR! Test failed. See above for more details.
ERROR: Job failed: exit status 1