Update rowSpan and call findOverflow again to make sure that content fits

Status Job ID Name Coverage
  Build
failed #951
npm-test

00:04:35

 
Name Stage Failure
failed
npm-test Build
npm ERR! Exit status 1
npm ERR!
npm ERR! Failed at the @ggrossetie/pagedjs@0.1.43-next.1615881898 specs script.
npm ERR! This is probably not a problem with npm. There is likely additional logging output above.

npm ERR! A complete log of this run can be found in:
npm ERR! /home/node/.npm/_logs/2021-03-27T18_07_11_888Z-debug.log
npm ERR! Test failed. See above for more details.
ERROR: Job failed: exit status 1