0.1.42-next.1600088292

2 jobs for v0.1.42-next.1600088292 in 5 minutes and 11 seconds (queued for 27 minutes and 7 seconds)
latest
Status Job ID Name Coverage
  Build
failed #783
npm-test

00:05:11

 
  Publish
skipped #784
npm-publish
 
Name Stage Failure
failed
npm-test Build
npm ERR! Exit status 1
npm ERR!
npm ERR! Failed at the @ggrossetie/pagedjs@0.1.42-next.1600088292 specs script.
npm ERR! This is probably not a problem with npm. There is likely additional logging output above.

npm ERR! A complete log of this run can be found in:
npm ERR! /home/node/.npm/_logs/2020-09-22T07_18_38_820Z-debug.log
npm ERR! Test failed. See above for more details.
ERROR: Job failed: exit status 1