resolves #248 avoid break inside table cell

Status Job ID Name Coverage
  Build
failed #773
npm-test

00:00:12

 
Name Stage Failure
failed
npm-test Build
npm ERR! Exit status 1
npm ERR!
npm ERR! Failed at the pagedjs@0.1.42 build script.
npm ERR! This is probably not a problem with npm. There is likely additional logging output above.

npm ERR! A complete log of this run can be found in:
npm ERR! /home/node/.npm/_logs/2020-09-21T08_36_46_981Z-debug.log
npm ERR! Test failed. See above for more details.
ERROR: Job failed: exit status 1