0.1.42-next.1600088292

1 job for next in 5 minutes and 51 seconds (queued for 8 seconds)
Status Job ID Name Coverage
  Build
failed #770
npm-test

00:05:51

 
Name Stage Failure
failed
npm-test Build
npm ERR! Exit status 1
npm ERR!
npm ERR! Failed at the @ggrossetie/pagedjs@0.1.42-next.1600088292 specs script.
npm ERR! This is probably not a problem with npm. There is likely additional logging output above.

npm ERR! A complete log of this run can be found in:
npm ERR! /home/node/.npm/_logs/2020-09-14T13_05_12_112Z-debug.log
npm ERR! Test failed. See above for more details.
ERROR: Job failed: exit status 1