resolves #243 cascade styles

1 job for issue-243-multi-at-page-def in 4 minutes and 15 seconds (queued for 3 minutes and 13 seconds)
Status Job ID Name Coverage
  Build
failed #768
npm-test

00:04:15

 
Name Stage Failure
failed
npm-test Build
npm ERR! Exit status 1
npm ERR!
npm ERR! Failed at the pagedjs@0.1.42 specs script.
npm ERR! This is probably not a problem with npm. There is likely additional logging output above.

npm ERR! A complete log of this run can be found in:
npm ERR! /home/node/.npm/_logs/2020-09-11T15_10_06_256Z-debug.log
npm ERR! Test failed. See above for more details.
ERROR: Job failed: exit status 1