0.1.36

1 job for master in 3 minutes and 9 seconds (queued for 1 second)
Status Job ID Name Coverage
  Build
failed #493
npm-test

00:03:09

 
Name Stage Failure
failed
npm-test Build
npm ERR! Exit status 1
npm ERR!
npm ERR! Failed at the pagedjs@0.1.36 specs script.
npm ERR! This is probably not a problem with npm. There is likely additional logging output above.

npm ERR! A complete log of this run can be found in:
npm ERR! /home/node/.npm/_logs/2020-02-14T12_50_08_683Z-debug.log
npm ERR! Test failed. See above for more details.
ERROR: Job failed: exit status 1