resolves #164 remove elements that do not affect the layout

1 job for issue-164-display-none in 4 minutes and 12 seconds (queued for 1 second)
Status Job ID Name Coverage
  Build
failed #455
npm-test

00:04:12

 
Name Stage Failure
failed
npm-test Build
npm ERR! Exit status 1
npm ERR!
npm ERR! Failed at the pagedjs@0.1.35 specs script.
npm ERR! This is probably not a problem with npm. There is likely additional logging output above.

npm ERR! A complete log of this run can be found in:
npm ERR! /home/node/.npm/_logs/2019-12-21T17_21_44_306Z-debug.log
npm ERR! Test failed. See above for more details.
ERROR: Job failed: exit status 1